BDBM264166 (S,E)-N-(4-(3-chloro-4-fluorophenylamino)-7-(cyclopropylmethoxy)quinazolin-6-yl)-4-(2-(methoxymethyl)azetidin-1-yl)but-2-enamide::US9714235, 10
SMILES COC[C@@H]1CCN1C\C=C\C(=O)Nc1cc2c(Nc3ccc(F)c(Cl)c3)ncnc2cc1OCC1CC1
InChI Key InChIKey=ICKLZZYEDMBELM-PHXNAMCJSA-N
Data  2 IC50
  Tab Delimited (TSV)   2D SDfile   Computed 3D by Vconf -m prep SDfile
Find this compound or compounds like it in BindingDB:
Activity Spreadsheet -- Enzyme Inhibition Constant Data from BindingDB
Found 2 hits for monomerid = 264166
TargetReceptor tyrosine-protein kinase erbB-2(Homo sapiens (Human))
Shanghai Fochon Pharmaceutical
US Patent
LigandPNGBDBM264166((S,E)-N-(4-(3-chloro-4-fluorophenylamino)-7-(cyclo...)
Affinity DataIC50:  32.8nM. Assay description: To investigate whether a compound is able to inhibit the activity of EGFR and ErbB2 in cells, a mechanism-based assay using BT474 (EGFR overexpressio...
Ligand InfoPC cidPC sid
In DepthDetails US Patent
TargetEpidermal growth factor receptor(Homo sapiens (Human))
Shanghai Fochon Pharmaceutical
US Patent
LigandPNGBDBM264166((S,E)-N-(4-(3-chloro-4-fluorophenylamino)-7-(cyclo...)
Affinity DataIC50:  21.7nM. Assay description: To investigate whether a compound is able to inhibit the activity of EGFR and ErbB2 in cells, a mechanism-based assay using BT474 (EGFR overexpressio...
Ligand InfoPC cidPC sid
In DepthDetails US Patent