BDBM265131 US9718808, 6
SMILES Cc1nc(cnc1C=O)-n1cnnn1
InChI Key InChIKey=SPNLVBNWKIJBDK-UHFFFAOYSA-N
Data  1 IC50
  Tab Delimited (TSV)   2D SDfile   Computed 3D by Vconf -m prep SDfile
Find this compound or compounds like it in BindingDB:
Activity Spreadsheet -- Enzyme Inhibition Constant Data from BindingDB
Found 1 hit for monomerid = 265131
TargetATP-sensitive inward rectifier potassium channel 1(Homo sapiens (Human))
Merck Sharp & Dohme
US Patent
LigandPNGBDBM265131(US9718808, 6)
Affinity DataIC50:  450nM. Assay description: A Thallium Flux Assay was performed on each of the final product compounds of the Examples. This assay has been described previously; see, e.g., PCT ...
Ligand InfoPC cidPC sid
In DepthDetails US Patent