BDBM265236 US10413550, Example 67::US11234987, Example 67::US9718793, 67
SMILES CCNC(=O)c1noc(c1-c1ccc(F)cc1)-c1cc(c(O)cc1O)-c1ccccc1
InChI Key InChIKey=VPMAFJSVQSZSRK-UHFFFAOYSA-N
Data  3 IC50
  Tab Delimited (TSV)   2D SDfile   Computed 3D by Vconf -m prep SDfile
Find this compound or compounds like it in BindingDB:
Activity Spreadsheet -- Enzyme Inhibition Constant Data from BindingDB
Found 3 hits for monomerid = 265236
TargetHeat shock protein HSP 90-alpha(Homo sapiens (Human))
The Institute of Cancer Research
US Patent
LigandPNGBDBM265236(US10413550, Example 67 | US11234987, Example 67 | ...)
Affinity DataIC50: <1.00E+4nM. Assay description: Fluorescence polarization {also known as fluorescence anisotropy} measures the rotation of a fluorescing species in solution, where the larger molecu...
Ligand InfoPC cidPC sid
In DepthDetails US Patent
TargetATP-dependent molecular chaperone HSP82(Saccharomyces cerevisiae)
Cancer Research Technology
US Patent
LigandPNGBDBM265236(US10413550, Example 67 | US11234987, Example 67 | ...)
Affinity DataIC50: <1.00E+4nM. Assay description: 1) Costar 96-well black assay plate. Assay buffer of (a) 100 mM Tris pH7.4; (b) 20 mM KCl; (c) 6 mM MgCl2. Stored at room temperature.3) BSA (bovine ...
Ligand InfoPC cidPC sid
In DepthDetails US Patent
TargetEndoplasmin/Heat shock protein 75/Heat shock protein HSP 90-alpha/Heat shock protein HSP 90-beta(Homo sapiens (Human))
The Institute of Cancer Research
US Patent
LigandPNGBDBM265236(US10413550, Example 67 | US11234987, Example 67 | ...)
Affinity DataIC50: <1.00E+4nM. Assay description:  (1) Greiner 384-well (Greiner 781101) or Costar 384-well flat-bottomed polystyrene multiwell plates (VWR). (2) Assay buffer of (a) 100 mM Tris...
Ligand InfoPC cidPC sid
In DepthDetails US Patent