BDBM26857 N-[(2E)-5-[benzene(methyl)amido]-1-(2-carbamoylethyl)-2,3-dihydro-1H-1,3-benzodiazol-2-ylidene]-5-(5-cyanopyridin-3-yl)thiophene-2-carboxamide::acylated 2-aminobenzimidazole, 51
SMILES CN(C(=O)c1ccccc1)c1ccc2n(CCC(N)=O)c(NC(=O)c3ccc(s3)-c3cncc(c3)C#N)nc2c1
InChI Key InChIKey=PKTNBTZGPAUVEF-UHFFFAOYSA-N
Data  2 IC50
  Tab Delimited (TSV)   2D SDfile   Computed 3D by Vconf -m prep SDfile
Find this compound or compounds like it in BindingDB:
Activity Spreadsheet -- Enzyme Inhibition Constant Data from BindingDB
Found 2 hits for monomerid = 26857
TargetInsulin receptor(Homo sapiens (Human))
Boehringer Ingelheim Pharmaceuticals
LigandPNGBDBM26857(N-[(2E)-5-[benzene(methyl)amido]-1-(2-carbamoyleth...)
Affinity DataIC50: >6.00E+3nM. Assay description: Kinase is purified as a GST-fusion protein. The kinase activity is measured using DELFIA which utilizes europium chelate-labeled anti-phosphotyrosine...
In DepthDetails ArticlePubMed
TargetTyrosine-protein kinase ITK/TSK(Homo sapiens (Human))
Boehringer Ingelheim Pharmaceuticals
LigandPNGBDBM26857(N-[(2E)-5-[benzene(methyl)amido]-1-(2-carbamoyleth...)
Affinity DataIC50:  2nM. Assay description: Kinase is purified as a GST-fusion protein. The kinase activity is measured using DELFIA which utilizes europium chelate-labeled anti-phosphotyrosine...
In DepthDetails ArticlePubMed