BDBM269514 (2R)-1-(5-fluoro-2-pyrimidinyl)-N-(4-(2-methoxyphenyl)-5-(6-methoxy-2-pyridinyl)-4H-1,2,4-triazol-3-yl)-2-propanesulfonamide, (2S)-1-(5-fluoro-2-pyrimidinyl)-N-(4-(2-methoxyphenyl)-5-(6-methoxy-2-pyridinyl)-4H-1,2,4-triazol-3-yl)-2-propanesulfonamide::US10058550, Example 31.0::US10221162, Example 31.0::US9845310, Example 31.0
SMILES COc1cccc(n1)-c1nnc(NS(=O)(=O)[C@H](C)Cc2ncc(F)cn2)n1-c1ccccc1OC
InChI Key InChIKey=FCIJIZYSWPRQFA-CQSZACIVSA-N
Data  3 EC50
  Tab Delimited (TSV)   2D SDfile   Computed 3D by Vconf -m prep SDfile
Find this compound or compounds like it in BindingDB:
Activity Spreadsheet -- Enzyme Inhibition Constant Data from BindingDB
Found 3 hits for monomerid = 269514
TargetApelin receptor(Homo sapiens (Human))
Amgen
US Patent
LigandPNGBDBM269514((2R)-1-(5-fluoro-2-pyrimidinyl)-N-(4-(2-methoxyphe...)
Affinity DataEC50:  2.40nMpH: 7.5Assay Description:The human APJ receptor was cloned by polymerase chain reaction and the gene encoding the receptor was subcloned in pFLAG-CMV¿-3 expression vector (Si...
Ligand InfoPC cidPC sid
In DepthDetails US Patent
TargetApelin receptor(Homo sapiens (Human))
Amgen
US Patent
LigandPNGBDBM269514((2R)-1-(5-fluoro-2-pyrimidinyl)-N-(4-(2-methoxyphe...)
Affinity DataEC50:  2.40nM. Assay description: The human APJ receptor was cloned by polymerase chain reaction and the gene encoding the receptor was subcloned in pFLAG-CMV-3 expression vector (Sig...
Ligand InfoPC cidPC sid
In DepthDetails US Patent
TargetApelin receptor(Homo sapiens (Human))
Amgen
US Patent
LigandPNGBDBM269514((2R)-1-(5-fluoro-2-pyrimidinyl)-N-(4-(2-methoxyphe...)
Affinity DataEC50:  2.40nM. Assay description: The human APJ receptor was cloned by polymerase chain reaction and the gene encoding the receptor was subcloned in pFLAG-CMV™-3 expression vector (Si...
Ligand InfoPC cidPC sid
In DepthDetails US Patent