BDBM276770 US10071995, Example 4
SMILES COc1cn(C(Cc2ccncc2)C(=O)Nc2cc(F)c(s2)C(N)=O)c(=O)cc1-c1cc(Cl)ccc1C#N
InChI Key InChIKey=NFRQLICWPZKLQL-UHFFFAOYSA-N
Data  2 IC50
  Tab Delimited (TSV)   2D SDfile   Computed 3D by Vconf -m prep SDfile
Find this compound or compounds like it in BindingDB:
Activity Spreadsheet -- Enzyme Inhibition Constant Data from BindingDB
Found 2 hits for monomerid = 276770
TargetPlasma kallikrein(Homo sapiens (Human))
Bayer Pharma Aktiengesellschaft
US Patent
LigandPNGBDBM276770(US10071995, Example 4)
Affinity DataIC50:  36nMpH: 7.4 T: 2°C. Assay description: Test substances are dissolved in dimethyl sulphoxide and serially diluted in dimethyl sulphoxide (3000 μM to 0.0078 μM; resulting final con...
Ligand InfoPC cidPC sid
In DepthDetails US Patent
TargetPlasma kallikrein(Homo sapiens (Human))
Bayer Pharma Aktiengesellschaft
US Patent
LigandPNGBDBM276770(US10071995, Example 4)
Affinity DataIC50:  29nMpH: 7.4 T: 2°C. Assay description: Test substances are dissolved in dimethyl sulphoxide and serially diluted in dimethyl sulphoxide (3000 μM to 0.0078 μM; resulting final con...
Ligand InfoPC cidPC sid
In DepthDetails US Patent