BDBM276812 WO2011044181, Example 165
SMILES COc1cccnc1Nc1ccnc(c1)[C@]1(C)CS(=O)(=O)N(C)C(=N)N1
InChI Key InChIKey=PRBDLUPMMVCGBJ-INIZCTEOSA-N
Data  2 KI
  Tab Delimited (TSV)   2D SDfile   Computed 3D by Vconf -m prep SDfile
Find this compound or compounds like it in BindingDB:
Activity Spreadsheet -- Enzyme Inhibition Constant Data from BindingDB
Found 2 hits for monomerid = 276812
TargetBeta-secretase 1(Homo sapiens (Human))
TBA
US Patent
LigandPNGBDBM276812(WO2011044181, Example 165)
Affinity DataKi:  48nMpH: 5.0Assay Description:The following reagents were used in this assay. Na+-Acetate pH 5.0; 1% Brij-35; Glycerol; Dimethyl Sulfoxide (DMSO); Recombinant human soluble BACE-1...
Ligand InfoPC cidPC sid
In DepthDetails US Patent
TargetBeta-secretase 1(Homo sapiens (Human))
TBA
US Patent
LigandPNGBDBM276812(WO2011044181, Example 165)
Affinity DataKi:  2.59E+3nMpH: 5.0Assay Description:The following reagents were used in this assay. Na+-Acetate pH 5.0; 1% Brij-35; Glycerol; Dimethyl Sulfoxide (DMSO); Recombinant human soluble BACE-1...
Ligand InfoPC cidPC sid
In DepthDetails US Patent