BDBM27811 2-fluoro-6-({2-[(5-methoxy-1-{3-[4-(propan-2-yl)piperazin-1-yl]propanoyl}-2,3-dihydro-1H-indol-6-yl)amino]-7H-pyrrolo[2,3-d]pyrimidin-4-yl}amino)benzamide::pyrrolo[2,3-d]pyrimidine deriv., 34
SMILES COc1cc2CCN(C(=O)CCN3CCN(CC3)C(C)C)c2cc1Nc1nc(Nc2cccc(F)c2C(N)=O)c2cc[nH]c2n1
InChI Key InChIKey=IRAGSKPXCRLVGU-UHFFFAOYSA-N
Data  2 IC50
  Tab Delimited (TSV)   2D SDfile   Computed 3D by Vconf -m prep SDfile
Find this compound or compounds like it in BindingDB:
Activity Spreadsheet -- Enzyme Inhibition Constant Data from BindingDB
Found 2 hits for monomerid = 27811
TargetMitogen-activated protein kinase 8(Homo sapiens (Human))
Gsk
LigandPNGBDBM27811(2-fluoro-6-({2-[(5-methoxy-1-{3-[4-(propan-2-yl)pi...)
Affinity DataIC50:  1.59E+3nM. Assay description: Assays are performed in 384-well microtiter plates in reaction buffer containing substrate GST-biotin-C-JUN, ATP, and purified activated JNK1alpha1 i...
In DepthDetails ArticlePubMed
TargetInsulin-like growth factor 1 receptor(Homo sapiens (Human))
Gsk
LigandPNGBDBM27811(2-fluoro-6-({2-[(5-methoxy-1-{3-[4-(propan-2-yl)pi...)
Affinity DataIC50:  4nM. Assay description: Assays are performed in 384-well microtiter plates in reaction buffer containing biotinylated substrate, ATP, and purified activated GST-IGF-1R in th...
In DepthDetails ArticlePubMed