BDBM278423 (2R)-2-(4-Fluoro-3-methoxy-phenyl)-2-methoxy-N-[5-[[(3R)-1-pyridazin-3-ylpyrrolidin-3-yl]amino]-1,3,4-thiadiazol-2-yl]acetamide::US10040788, Example 14(b)::US10294221, Example 14(b)
SMILES CO[C@@H](C(=O)Nc1nnc(N[C@@H]2CCN(C2)c2cccnn2)s1)c1ccc(F)c(OC)c1
InChI Key InChIKey=ZORUYOFUHTVLOX-CXAGYDPISA-N
Data  2 IC50
  Tab Delimited (TSV)   2D SDfile   Computed 3D by Vconf -m prep SDfile
Find this compound or compounds like it in BindingDB:
Activity Spreadsheet -- Enzyme Inhibition Constant Data from BindingDB
Found 2 hits for monomerid = 278423
TargetGlutaminase kidney isoform, mitochondrial(Homo sapiens (Human))
Astrazeneca
US Patent
LigandPNGBDBM278423((2R)-2-(4-Fluoro-3-methoxy-phenyl)-2-methoxy-N-[5-...)
Affinity DataIC50:  168nM. Assay description: A Glutamate Oxidase/AmplexRed coupled assay was used to measure the ability of compounds to bind to and inhibit the activity of GLS1 in vitro. 6His t...
Ligand InfoPC cidPC sid
In DepthDetails US Patent
TargetGlutaminase kidney isoform, mitochondrial(Homo sapiens (Human))
Astrazeneca
US Patent
LigandPNGBDBM278423((2R)-2-(4-Fluoro-3-methoxy-phenyl)-2-methoxy-N-[5-...)
Affinity DataIC50:  168nMpH: 7.8Assay Description:A Glutamate Oxidase/AmplexRed coupled assay was used to measure the ability of compounds to bind to and inhibit the activity of GLS1 in vitro. 6His t...
Ligand InfoPC cidPC sid
In DepthDetails US Patent