BDBM278451 US10040788, Example 31(a)::US10294221, Example 31(a)
SMILES CCO[C@@H](C(=O)Nc1nnc(N[C@@H]2CCN(C2)c2cccnn2)s1)c1ccc(F)c(OC)c1
InChI Key InChIKey=IYPATRWUVVTXAW-RDTXWAMCSA-N
Data  2 IC50
  Tab Delimited (TSV)   2D SDfile   Computed 3D by Vconf -m prep SDfile
Find this compound or compounds like it in BindingDB:
Activity Spreadsheet -- Enzyme Inhibition Constant Data from BindingDB
Found 2 hits for monomerid = 278451
TargetGlutaminase kidney isoform, mitochondrial(Homo sapiens (Human))
Astrazeneca
US Patent
LigandPNGBDBM278451(US10040788, Example 31(a) | US10294221, Example 31...)
Affinity DataIC50:  50.2nM. Assay description: A Glutamate Oxidase/AmplexRed coupled assay was used to measure the ability of compounds to bind to and inhibit the activity of GLS1 in vitro. 6His t...
Ligand InfoPC cidPC sid
In DepthDetails US Patent
TargetGlutaminase kidney isoform, mitochondrial(Homo sapiens (Human))
Astrazeneca
US Patent
LigandPNGBDBM278451(US10040788, Example 31(a) | US10294221, Example 31...)
Affinity DataIC50:  50.2nMpH: 7.8Assay Description:A Glutamate Oxidase/AmplexRed coupled assay was used to measure the ability of compounds to bind to and inhibit the activity of GLS1 in vitro. 6His t...
Ligand InfoPC cidPC sid
In DepthDetails US Patent