BDBM278795 N-(2-chlorophenyl)-2- {[(1R,2S)-2- hydroxycyclohexyl] amino}pyrrolo[1,2- b]pyridazine-7- carboxamide trifluoroacetate::US10040798, Example 93
SMILES OC(=O)C(F)(F)F.O[C@H]1CCCC[C@H]1Nc1ccc2ccc(C(=O)Nc3ccccc3Cl)n2n1
InChI Key InChIKey=ICGMJPNKXRKVNG-CLRXKPRGSA-N
Data  1 IC50
  Tab Delimited (TSV)   2D SDfile   Computed 3D by Vconf -m prep SDfile
Find this compound or compounds like it in BindingDB:
Activity Spreadsheet -- Enzyme Inhibition Constant Data from BindingDB
Found 1 hit for monomerid = 278795
TargetInterleukin-1 receptor-associated kinase 4(Homo sapiens (Human))
Merck Sharp & Dohme
US Patent
LigandPNGBDBM278795(N-(2-chlorophenyl)-2- {[(1R,2S)-2- hydroxycyclohex...)
Affinity DataIC50:  6.84E+3nMpH: 7.2Assay Description:The kinase activity of IRAK4 is determined by its ability to catalyze the phosphorylation of a fluorescent polypeptide substrate. The extent of phosp...
Ligand InfoPC cidPC sid
In DepthDetails US Patent