BDBM279517 4-methyl-2-(5-(pyridin-4-yl)-1H-benzo[d]imidazol-2-yl) pentan-1-amine::US10035777, Example 67
SMILES CC(C)CC(CNC(=O)OC(C)(C)C)C(=O)Nc1ccc(Br)cc1N
InChI Key InChIKey=FEHCFRNLECNRMI-UHFFFAOYSA-N
Data  1 IC50
  Tab Delimited (TSV)   2D SDfile   Computed 3D by Vconf -m prep SDfile
Find this compound or compounds like it in BindingDB:
Activity Spreadsheet -- Enzyme Inhibition Constant Data from BindingDB
Found 1 hit for monomerid = 279517
TargetAP2-associated protein kinase 1(Homo sapiens (Human))
Bristol-Myers Squibb
US Patent
LigandPNGBDBM279517(4-methyl-2-(5-(pyridin-4-yl)-1H-benzo[d]imidazol-2...)
Affinity DataIC50:  49nMpH: 7.4 T: 2°C. Assay description: The assays were performed in U-bottom 384-well plates. The final assay volume was 30 μl prepared from 15 μl additions of enzyme and substra...
Ligand InfoPC cidPC sid
In DepthDetails US Patent