BDBM289434 5-(2-cyclopropyl-1-(3-(4-(2,2,2-trifluoroethyl)piperazin-1-yl)bicyclo[1.1.1]pentan-1-yl)-1H-imidazol-4-yl)-3-(trifluoromethoxy)pyridin-2-amine::US10093664, Example 15
SMILES Nc1ncc(cc1OC(F)(F)F)-c1cn(c(n1)C1CC1)C12CC(C1)(C2)N1CCN(CC(F)(F)F)CC1
InChI Key InChIKey=PYNDXIYBQJWGRM-UHFFFAOYSA-N
Data  1 Kd
  Tab Delimited (TSV)   2D SDfile   Computed 3D by Vconf -m prep SDfile
Find this compound or compounds like it in BindingDB:
Activity Spreadsheet -- Enzyme Inhibition Constant Data from BindingDB
Found 1 hit for monomerid = 289434
TargetMitogen-activated protein kinase kinase kinase 12(Homo sapiens (Human))
The University of Texas System
US Patent
LigandPNGBDBM289434(5-(2-cyclopropyl-1-(3-(4-(2,2,2-trifluoroethyl)pip...)
Affinity DataKd:  18nM. Assay description: The DLK dissociation constants (Kd) have been determined in the KINOMEscan KdELECT Service at DiscoveRx. A fusion protein of full length of human DLK...
Ligand InfoPC cidPC sid
In DepthDetails US Patent