BDBM290424 (3R,4S)-3-amino-1-(2-(benzylamino)acetyl)-4-(3- boronopropyl)pyrrolidine-3-carboxylic acid::US10098902, Example 60::US10603330, Example 60::US11389464, Example 60
SMILES N[C@]1(CN(C[C@@H]1CCCB(O)O)C(=O)CNCc1ccccc1)C(O)=O
InChI Key InChIKey=MVNNCCLPZIQKIV-YOEHRIQHSA-N
Data  6 IC50
  Tab Delimited (TSV)   2D SDfile   Computed 3D by Vconf -m prep SDfile
Find this compound or compounds like it in BindingDB:
Activity Spreadsheet -- Enzyme Inhibition Constant Data from BindingDB
Found 6 hits for monomerid = 290424
TargetArginase-1(Homo sapiens (Human))
Mars
US Patent
LigandPNGBDBM290424((3R,4S)-3-amino-1-(2-(benzylamino)acetyl)-4-(3- bo...)
Affinity DataIC50:  625nMpH: 7.4 T: 2°C. Assay description: Inhibition of arginase I (ARG I) and arginase II (ARG II) by Formula I or Formula II compounds is followed spectrophotometrically at 530 nm. The comp...
Ligand InfoPC cidPC sid
In DepthDetails US Patent
TargetArginase-2, mitochondrial(Homo sapiens (Human))
Mars
US Patent
LigandPNGBDBM290424((3R,4S)-3-amino-1-(2-(benzylamino)acetyl)-4-(3- bo...)
Affinity DataIC50:  1.50E+3nMpH: 7.4 T: 2°C. Assay description: Inhibition of arginase I (ARG I) and arginase II (ARG II) by Formula I or Formula II compounds is followed spectrophotometrically at 530 nm. The comp...
Ligand InfoPC cidPC sid
In DepthDetails US Patent
TargetArginase-2, mitochondrial(Homo sapiens (Human))
Mars
US Patent
LigandPNGBDBM290424((3R,4S)-3-amino-1-(2-(benzylamino)acetyl)-4-(3- bo...)
Affinity DataIC50:  1.50E+3nM
Ligand InfoPC cidPC sid
In DepthDetails US Patent
TargetArginase-2, mitochondrial(Homo sapiens (Human))
Mars
US Patent
LigandPNGBDBM290424((3R,4S)-3-amino-1-(2-(benzylamino)acetyl)-4-(3- bo...)
Affinity DataIC50:  3.00E+3nM. Assay description: Inhibition of arginase I (ARG I) and arginase II (ARG II) by Formula I or Formula II compounds is followed spectrophotometrically at 530 nm. The comp...
Ligand InfoPC cidPC sid
In DepthDetails US Patent
TargetArginase-1(Homo sapiens (Human))
Mars
US Patent
LigandPNGBDBM290424((3R,4S)-3-amino-1-(2-(benzylamino)acetyl)-4-(3- bo...)
Affinity DataIC50:  625nM. Assay description: Inhibition of arginase I (ARG I) and arginase II (ARG II) by Formula I or Formula II compounds is followed spectrophotometrically at 530 nm. The comp...
Ligand InfoPC cidPC sid
In DepthDetails US Patent
TargetArginase-1(Homo sapiens (Human))
Mars
US Patent
LigandPNGBDBM290424((3R,4S)-3-amino-1-(2-(benzylamino)acetyl)-4-(3- bo...)
Affinity DataIC50:  2.00E+3nM. Assay description: Inhibition of arginase I (ARG I) and arginase II (ARG II) by Formula I or Formula II compounds is followed spectrophotometrically at 530 nm. The comp...
Ligand InfoPC cidPC sid
In DepthDetails US Patent