BDBM290836 2-((1R,2S)-2-aminocyclohexylamino)-4-(3-(2,3-dihydrobenzofuran-5-yl)phenylamino)pyrimidine-5-carboxamide::US9579320, Example 236
SMILES N[C@H]1CCCC[C@H]1Nc1ncc(C(N)=O)c(Nc2cccc(c2)-c2ccc3OCCc3c2)n1
InChI Key InChIKey=WULKPVZACGCOCI-LEWJYISDSA-N
Data  1 IC50
  Tab Delimited (TSV)   2D SDfile   Computed 3D by Vconf -m prep SDfile
Find this compound or compounds like it in BindingDB:
Activity Spreadsheet -- Enzyme Inhibition Constant Data from BindingDB
Found 1 hit for monomerid = 290836
TargetTyrosine-protein kinase SYK(Homo sapiens (Human))
Portola Pharmaceuticals
US Patent
LigandPNGBDBM290836(2-((1R,2S)-2-aminocyclohexylamino)-4-(3-(2,3-dihyd...)
Affinity DataIC50:  5.5nMpH: 7.5 T: 2°C. Assay description: Potency of candidate molecules for inhibiting syk tyrosine phosphorylation activity is assessed by measuring the ability of a test compound to inhibi...
Ligand InfoPC cidPC sid
In DepthDetails US Patent