BDBM292311 US10100057, Example 166::US11046702, Example 166::US9745310, Example 166
SMILES Fc1cc(OCc2cn3cc(cnc3n2)-c2ccccc2F)ccn1
InChI Key InChIKey=FQWJDLTWOLOPHI-UHFFFAOYSA-N
Data  3 EC50
  Tab Delimited (TSV)   2D SDfile   Computed 3D by Vconf -m prep SDfile
Find this compound or compounds like it in BindingDB:
Activity Spreadsheet -- Enzyme Inhibition Constant Data from BindingDB
Found 3 hits for monomerid = 292311
TargetMetabotropic glutamate receptor 5(Homo sapiens (Human))
Sk Biopharmaceuticals
US Patent
LigandPNGBDBM292311(US10100057, Example 166 | US11046702, Example 166 ...)
Affinity DataEC50:  300nMT: 2°C. Assay description: Ca2+ (calcium) influx assay is an experiment for measuring the activity of a positive allosteric modulator of mGluR5 receptor in which human mGluR5 r...
Ligand InfoPC cidPC sid
In DepthDetails US Patent
TargetMetabotropic glutamate receptor 5(Homo sapiens (Human))
Sk Biopharmaceuticals
US Patent
LigandPNGBDBM292311(US10100057, Example 166 | US11046702, Example 166 ...)
Affinity DataEC50:  300nM. Assay description: Ca2+ (calcium) influx assay is an experiment for measuring the activity of a positive allosteric modulator of mGluR5 receptor in which human mGluR5 r...
Ligand InfoPC cidPC sid
In DepthDetails US Patent
TargetMetabotropic glutamate receptor 5(Homo sapiens (Human))
Sk Biopharmaceuticals
US Patent
LigandPNGBDBM292311(US10100057, Example 166 | US11046702, Example 166 ...)
Affinity DataEC50:  300nM. Assay description: Ca2+ (calcium) influx assay is an experiment for measuring the activity of a positive allosteric modulator of mGluR5 receptor in which human mGluR5 r...
Ligand InfoPC cidPC sid
In DepthDetails US Patent