BDBM296094 2-[4-(methyl-m-tolyl-amino)-phenoxy]- pyrido[3,4-d]pyrimidin-4-ol::US10112940, Example 21::US10202381, Example 21::US10208039, Example 21::US10611763, Example 21::US10815234, Example 21::US11535616, Example 21
SMILES CN(c1ccc(Oc2nc(O)c3ccncc3n2)cc1)c1cccc(C)c1
InChI Key InChIKey=AFHPEJCZXXGCJW-UHFFFAOYSA-N
Data  2 IC50
  Tab Delimited (TSV)   2D SDfile   Computed 3D by Vconf -m prep SDfile
Find this compound or compounds like it in BindingDB:
Activity Spreadsheet -- Enzyme Inhibition Constant Data from BindingDB
Found 2 hits for monomerid = 296094
TargetLysine-specific demethylase 4C(Homo sapiens (Human))
Celgene Quanticel Research
US Patent
LigandPNGBDBM296094(2-[4-(methyl-m-tolyl-amino)-phenoxy]- pyrido[3,4-d...)
Affinity DataIC50:  550nM. Assay description: The ability of test compounds to inhibit the activity of JMJD2C was determined in 384-well plate-format under the following reaction conditions: 0.3 ...
Ligand InfoPC cidPC sid
In DepthDetails US Patent
TargetLysine-specific demethylase 4C(Homo sapiens (Human))
Celgene Quanticel Research
US Patent
LigandPNGBDBM296094(2-[4-(methyl-m-tolyl-amino)-phenoxy]- pyrido[3,4-d...)
Affinity DataIC50:  550nMT: 2°C. Assay description: The ability of test compounds to inhibit the activity of JMJD2C was determined in 384-well plate format under the following reaction conditions: 0.3 ...
Ligand InfoPC cidPC sid
In DepthDetails US Patent