BDBM29661 2-Amino-1-furan-2-ylmethyl-1H-pyrrolo[2,3-b]quinoxaline-3-carboxylic acid isobutyl-amide::2-amino-1-(2-furanylmethyl)-N-(2-methylpropyl)-3-pyrrolo[3,2-b]quinoxalinecarboxamide::2-amino-1-(2-furfuryl)-N-isobutyl-pyrrolo[3,2-b]quinoxaline-3-carboxamide::2-amino-1-(furan-2-ylmethyl)-N-(2-methylpropyl)pyrrolo[3,2-b]quinoxaline-3-carboxamide::2-azanyl-1-(furan-2-ylmethyl)-N-(2-methylpropyl)pyrrolo[3,2-b]quinoxaline-3-carboxamide::MLS000556576::SMR000147893::cid_1881699
SMILES CC(C)CNC(=O)c1c(N)n(Cc2ccco2)c2nc3ccccc3nc12
InChI Key InChIKey=WSKCZZJHPRBJLI-UHFFFAOYSA-N
Data  3 IC50
  Tab Delimited (TSV)   2D SDfile   Computed 3D by Vconf -m prep SDfile
Find this compound or compounds like it in BindingDB:
Activity Spreadsheet -- Enzyme Inhibition Constant Data from BindingDB
Found 3 hits for monomerid = 29661
TargetRunt-related transcription factor 1(Homo sapiens (Human))
Burnham Center For Chemical Genomics
Curated by PubChem BioAssay
LigandPNGBDBM29661(2-Amino-1-furan-2-ylmethyl-1H-pyrrolo[2,3-b]quinox...)
Affinity DataIC50:  1.17E+4nMpH: 7.4 T: 2°C. Assay description: This assay is to use HTS to identify inhibitors of the protein-protein interaction between the RUNX1 Runt domain and CBFbeta-SMMHC, a potential thera...
In DepthDetails PCBioAssay
TargetInduced myeloid leukemia cell differentiation protein Mcl-1(Homo sapiens (Human))
Emory University
Curated by PubChem BioAssay
LigandPNGBDBM29661(2-Amino-1-furan-2-ylmethyl-1H-pyrrolo[2,3-b]quinox...)
Affinity DataIC50:  4.40E+3nM. Assay description: NIH Molecular Libraries Screening Centers Network [MLSCN] Emory Chemical Biology Discovery Center in MLSCN Assay provider: Nikolovska-Coleska, Univer...
In DepthDetails PCBioAssay
TargetRunt-related transcription factor 1(Homo sapiens (Human))
Burnham Center For Chemical Genomics
Curated by PubChem BioAssay
LigandPNGBDBM29661(2-Amino-1-furan-2-ylmethyl-1H-pyrrolo[2,3-b]quinox...)
Affinity DataIC50:  1.17E+4nMpH: 7.4 T: 2°C. Assay description: This assay is to identify inhibitors of the protein-protein interaction between the RUNX1 Runt domain and CBFbeta-SMMHC. This is accomplished by usin...
In DepthDetails PCBioAssay