BDBM300205 3-[(1-Cyclopropyltetrazol-5-yl)methyl]-7-(3,3-difluoropyrrolidin-1-yl)-5-[(2S)-1,1,1-trifluoropropan-2-yl]oxytriazolo[4,5-d]pyrimidine::US9593123, Example 76
SMILES C[C@H](Oc1nc(N2CCC(F)(F)C2)c2nnn(Cc3nnnn3C3CC3)c2n1)C(F)(F)F
InChI Key InChIKey=XBXBQBBAARJRLB-QMMMGPOBSA-N
Data  2 EC50
  Tab Delimited (TSV)   2D SDfile   Computed 3D by Vconf -m prep SDfile
Find this compound or compounds like it in BindingDB:
Activity Spreadsheet -- Enzyme Inhibition Constant Data from BindingDB
Found 2 hits for monomerid = 300205
TargetCannabinoid receptor 1(Homo sapiens (Human))
Hoffmann-La Roche
US Patent
LigandPNGBDBM300205(3-[(1-Cyclopropyltetrazol-5-yl)methyl]-7-(3,3-difl...)
Affinity DataEC50: >1.00E+4nM
Ligand InfoPC cidPC sid
In DepthDetails US Patent
TargetCannabinoid receptor 2(Homo sapiens (Human))
Hoffmann-La Roche
US Patent
LigandPNGBDBM300205(3-[(1-Cyclopropyltetrazol-5-yl)methyl]-7-(3,3-difl...)
Affinity DataEC50:  17.7nM. Assay description: CHO cells expressing human CB1 or CB2 receptors are seeded 17-24 hours prior to the experiment 50.000 cells per well in a black 96 well plate with fl...
Ligand InfoPC cidPC sid
In DepthDetails US Patent