BDBM300714 US10130642, Example 4-10
SMILES OCC(CC(Cc1ccc(cc1)-c1cccc(Cl)c1)NC(=O)c1cn(O)nn1)C(O)=O
InChI Key InChIKey=JOZYSZQZYSGLCV-UHFFFAOYSA-N
Data  1 KI
  Tab Delimited (TSV)   2D SDfile   Computed 3D by Vconf -m prep SDfile
Find this compound or compounds like it in BindingDB:
Activity Spreadsheet -- Enzyme Inhibition Constant Data from BindingDB
Found 1 hit for monomerid = 300714
TargetNeprilysin(Homo sapiens (Human))
Theravance Biopharma R&D Ip
US Patent
LigandPNGBDBM300714(US10130642, Example 4-10)
Affinity DataKi: <1nM. Assay description: Recombinant human NEP and recombinant human ACE were obtained commercially (R&D Systems, Minneapolis, Minn., catalog numbers 1182-ZN and 929-ZN, resp...
Ligand InfoPC cidPC sid
In DepthDetails US Patent