BDBM300865 3-(6-((3-(4-((1,1- Dioxidotetrahydro-2H- thiopyran-4-yl)methoxy)-2- methylphenyl)benzo[b]thiophen- 5-yl)methoxy)pyridin-3-yl) hex-4-ynoic acid::US10131648, Compound 63::US10195178, Compound 63::US9790198, Compound 63
SMILES CC#CC(CC(O)=O)c1ccc(OCc2ccc3scc(-c4ccc(OCC5CCS(=O)(=O)CC5)cc4C)c3c2)nc1
InChI Key InChIKey=OLVITPRGQZLQIF-UHFFFAOYSA-N
Data  3 EC50
  Tab Delimited (TSV)   2D SDfile   Computed 3D by Vconf -m prep SDfile
Find this compound or compounds like it in BindingDB:
Activity Spreadsheet -- Enzyme Inhibition Constant Data from BindingDB
Found 3 hits for monomerid = 300865
TargetFree fatty acid receptor 1(Homo sapiens (Human))
Janssen Pharmaceutica
US Patent
LigandPNGBDBM300865(3-(6-((3-(4-((1,1- Dioxidotetrahydro-2H- thiopyran...)
Affinity DataEC50:  10nM. Assay description: Compounds were tested in a calcium flux assay using transfected HEK293 cells stably expressing either human GPR40 or rat GPR40. Human GPR40 expressin...
Ligand InfoPC cidPC sid
In DepthDetails US Patent
TargetFree fatty acid receptor 1(Homo sapiens (Human))
Janssen Pharmaceutica
US Patent
LigandPNGBDBM300865(3-(6-((3-(4-((1,1- Dioxidotetrahydro-2H- thiopyran...)
Affinity DataEC50:  10nM. Assay description: Compounds were tested in a calcium flux assay using transfected HEK293 cells stably expressing either human GPR40 or rat GPR40. Human GPR40 expressin...
Ligand InfoPC cidPC sid
In DepthDetails US Patent
TargetFree fatty acid receptor 1(Homo sapiens (Human))
Janssen Pharmaceutica
US Patent
LigandPNGBDBM300865(3-(6-((3-(4-((1,1- Dioxidotetrahydro-2H- thiopyran...)
Affinity DataEC50:  10nM. Assay description: Compounds were tested in a calcium flux assay using transfected HEK293 cells stably expressing either human GPR40 or rat GPR40. Human GPR40 expressin...
Ligand InfoPC cidPC sid
In DepthDetails US Patent