BDBM301439 4-amino-7-{[1-(2-fluorophenyl)-1H-1,2,3-triazol-4-yl]methyl}-5-[2-(trifluoromethyl)pyrimidin-5-yl]pyrrolo[2,1-f][1,2,4]triazine-6-carbonitrile::US10131670, Example 22
SMILES Nc1ncnn2c(Cc3cn(nn3)-c3ccccc3F)c(C#N)c(-c3cnc(nc3)C(F)(F)F)c12
InChI Key InChIKey=LFDYXBUXKNDGQK-UHFFFAOYSA-N
Data  2 EC50
  Tab Delimited (TSV)   2D SDfile   Computed 3D by Vconf -m prep SDfile
Find this compound or compounds like it in BindingDB:
Activity Spreadsheet -- Enzyme Inhibition Constant Data from BindingDB
Found 2 hits for monomerid = 301439
TargetCystic fibrosis transmembrane conductance regulator(Homo sapiens (Human))
Cystic Fibrosis Foundation Therapeutics
US Patent
LigandPNGBDBM301439(4-amino-7-{[1-(2-fluorophenyl)-1H-1,2,3-triazol-4-...)
Affinity DataEC50:  23.3nM. Assay description: Fischer rat thyroid (FRT) cell lines stably expressing recombinant F508del V470 CFTR and halide-sensitive yellow fluorescent protein (Pedemonte et al...
Ligand InfoPC cidPC sid
In DepthDetails US Patent
TargetCystic fibrosis transmembrane conductance regulator(Homo sapiens (Human))
Cystic Fibrosis Foundation Therapeutics
US Patent
LigandPNGBDBM301439(4-amino-7-{[1-(2-fluorophenyl)-1H-1,2,3-triazol-4-...)
Affinity DataEC50:  27.1nM. Assay description: Primary cystic fibrosis human bronchial epithelial (CF hBE) cells were expanded and cultured according to published methods (Neuberger et al., Ch. 4 ...
Ligand InfoPC cidPC sid
In DepthDetails US Patent