BDBM301845 N-(4-(4-(2-(tert-Butyl)-6-(trifluoromethyl)pyrimidin-4-yl)piperazin-1-yl)butyl)-4-(pyridin-4-yl)piperazine-1-carboxamide::US9598387, Compound 31::US9969743, 31
SMILES CC(C)(C)c1nc(cc(n1)C(F)(F)F)N1CCN(CCCCNC(=O)N2CCN(CC2)c2ccncc2)CC1
InChI Key InChIKey=BGDWIZDSYFKVEK-UHFFFAOYSA-N
Data  4 KI
  Tab Delimited (TSV)   2D SDfile   Computed 3D by Vconf -m prep SDfile
Find this compound or compounds like it in BindingDB:
Activity Spreadsheet -- Enzyme Inhibition Constant Data from BindingDB
Found 4 hits for monomerid = 301845
TargetD(3) dopamine receptor(Homo sapiens (Human))
Southern Research Institute
US Patent
LigandPNGBDBM301845(N-(4-(4-(2-(tert-Butyl)-6-(trifluoromethyl)pyrimid...)
Affinity DataKi:  2.60nM. Assay description: Stably transfected HEK cells expressing the human D2-long and the D3 dopamine receptor were developed using the pIRESneo2 bicistronic expression vect...
Ligand InfoPC cidPC sid
In DepthDetails US Patent
TargetD(3) dopamine receptor(Homo sapiens (Human))
Southern Research Institute
US Patent
LigandPNGBDBM301845(N-(4-(4-(2-(tert-Butyl)-6-(trifluoromethyl)pyrimid...)
Affinity DataKi:  2.60nM. Assay description: The affinities of the target compounds were determined using radioligand binding experiments. All radioligand binding experiments were performed acco...
Ligand InfoPC cidPC sid
In DepthDetails US Patent
TargetD(2) dopamine receptor(Homo sapiens (Human))
Southern Research Institute
US Patent
LigandPNGBDBM301845(N-(4-(4-(2-(tert-Butyl)-6-(trifluoromethyl)pyrimid...)
Affinity DataKi:  97.4nM. Assay description: Stably transfected HEK cells expressing the human D2-long and the D3 dopamine receptor were developed using the pIRESneo2 bicistronic expression vect...
Ligand InfoPC cidPC sid
In DepthDetails US Patent
TargetD(2) dopamine receptor(Homo sapiens (Human))
Southern Research Institute
US Patent
LigandPNGBDBM301845(N-(4-(4-(2-(tert-Butyl)-6-(trifluoromethyl)pyrimid...)
Affinity DataKi:  97.4nM. Assay description: The affinities of the target compounds were determined using radioligand binding experiments. All radioligand binding experiments were performed acco...
Ligand InfoPC cidPC sid
In DepthDetails US Patent