BDBM301946 US9598396, Compound 19
SMILES CN(Cc1ccc(cc1)C#N)CC(C)(C#N)c1ccc2c3CCCCc3c(=O)[nH]c2c1
InChI Key
Data  1 IC50
  Tab Delimited (TSV)   2D SDfile   Computed 3D by Vconf -m prep SDfile
Find this compound or compounds like it in BindingDB:
Activity Spreadsheet -- Enzyme Inhibition Constant Data from BindingDB
Found 1 hit for monomerid = 301946
TargetPoly [ADP-ribose] polymerase tankyrase-2(Homo sapiens (Human))
Janssen Pharmaceutica
US Patent
LigandPNGBDBM301946(US9598396, Compound 19)
Affinity DataIC50:  64.6nM. Assay description: In principle, the assay relies upon the well established SPA technology for the detection of poly(ADP-ribosyl)ation of biotinylated target proteins, ...
Ligand InfoPC cidPC sid
In DepthDetails US Patent