BDBM309377 N-(6-(4-(4-cyano-3-(trifluoromethyl)phenoxy)phenyl)pyridin-2-yl)-2,3-dihydroxypropanamide::US9656959, Example 75
SMILES OCC(O)C(=O)Nc1cccc(n1)-c1ccc(Oc2ccc(C#N)c(c2)C(F)(F)F)cc1
InChI Key InChIKey=IADOXIJNBLECDN-UHFFFAOYSA-N
Data  1 IC50
  Tab Delimited (TSV)   2D SDfile   Computed 3D by Vconf -m prep SDfile
Find this compound or compounds like it in BindingDB:
Activity Spreadsheet -- Enzyme Inhibition Constant Data from BindingDB
Found 1 hit for monomerid = 309377
TargetSodium channel protein type 9 subunit alpha(Homo sapiens (Human))
Purdue Pharma
US Patent
LigandPNGBDBM309377(N-(6-(4-(4-cyano-3-(trifluoromethyl)phenoxy)phenyl...)
Affinity DataIC50:  609nM. Assay description: In vitro assays were performed in a recombinant cell line expressing cDNA encoding the alpha subunit (Nav1.7, SCN9a, PN1, NE) of human Nav1.7 (Access...
Ligand InfoPC cidPC sid
In DepthDetails US Patent