BDBM310110 US10377768, Compound 24::US9657033, Compound 24
SMILES C[C@H]1CN(c2cc(NC(=O)c3c(F)cccc3C(F)(F)F)cnc2O1)S(=O)(=O)c1cccc(C)c1
InChI Key InChIKey=HVWJZFMQLAXBNI-AWEZNQCLSA-N
Data  4 EC50
  Tab Delimited (TSV)   2D SDfile   Computed 3D by Vconf -m prep SDfile
Find this compound or compounds like it in BindingDB:
Activity Spreadsheet -- Enzyme Inhibition Constant Data from BindingDB
Found 4 hits for monomerid = 310110
TargetNuclear receptor ROR-gamma(Homo sapiens (Human))
Lycera
US Patent
LigandPNGBDBM310110(US10377768, Compound 24 | US9657033, Compound 24)
Affinity DataEC50:  132nM. Assay description: Recombinant,HIS-tagged RORγ-LBD was expressed in SF9 cells using a baculovirus expression system. Cells were lysed and the lysate was used as a ...
Ligand InfoPC cidPC sid
In DepthDetails US Patent
TargetNuclear receptor ROR-gamma(Homo sapiens (Human))
Lycera
US Patent
LigandPNGBDBM310110(US10377768, Compound 24 | US9657033, Compound 24)
Affinity DataEC50:  6nM. Assay description: HIS-tagged RORγ-LBD protein was expressed in SF9 cells using a baculovirus expression system. The RORγ-LBD protein was purified by glutathi...
Ligand InfoPC cidPC sid
In DepthDetails US Patent
TargetNuclear receptor ROR-gamma(Homo sapiens (Human))
Lycera
US Patent
LigandPNGBDBM310110(US10377768, Compound 24 | US9657033, Compound 24)
Affinity DataEC50:  132nM. Assay description: Recombinant, HIS-tagged RORγ-LBD was expressed in SF9 cells using a baculovirus expression system. Cells were lysed and the lysate was used as a...
Ligand InfoPC cidPC sid
In DepthDetails US Patent
TargetNuclear receptor ROR-gamma(Homo sapiens (Human))
Lycera
US Patent
LigandPNGBDBM310110(US10377768, Compound 24 | US9657033, Compound 24)
Affinity DataEC50:  6nM. Assay description: HIS-tagged RORγ-LBD protein was expressed in SF9 cells using a baculovirus expression system. The RORγ-LBD protein was purified by glutathi...
Ligand InfoPC cidPC sid
In DepthDetails US Patent