BDBM313896 US10167296, Example 2.07
SMILES COc1c(C)c2c(Nc3ccc(F)cc3O[C@H]3COC[C@@H]3O)ncnc2cc1N=S1(=O)CCC1
InChI Key InChIKey=GGFDCFKGTLXKLA-ICSRJNTNSA-N
Data  1 IC50
  Tab Delimited (TSV)   2D SDfile   Computed 3D by Vconf -m prep SDfile
Find this compound or compounds like it in BindingDB:
Activity Spreadsheet -- Enzyme Inhibition Constant Data from BindingDB
Found 1 hit for monomerid = 313896
TargetMAP kinase-interacting serine/threonine-protein kinase 2(Homo sapiens (Human))
Evotec International
US Patent
LigandPNGBDBM313896(US10167296, Example 2.07)
Affinity DataIC50:  2.70nM. Assay description: The inhibition of kinase activity of MNK2a was assessed using pre-activated GST-MNK2a. The white, 384-well OptiPlate F plates were purchased from Per...
Ligand InfoPC cidPC sid
In DepthDetails US Patent