BDBM314096 US9610322, 6b (trans olefin)
SMILES NC(=C)CC[C@@H]1NC(=O)\C=C\C(=O)N[C@@H](CCCCCC(=O)C(Cc2ccc(cc2)C(=O)c2ccccc2)NC(=O)[C@H](CC2CCCCC2)CC1=O)C(N)=O
InChI Key InChIKey=OPIMKBVXMOFIMR-VRQXRQBFSA-N
Data  1 IC50
  Tab Delimited (TSV)   2D SDfile   Computed 3D by Vconf -m prep SDfile
Find this compound or compounds like it in BindingDB:
Activity Spreadsheet -- Enzyme Inhibition Constant Data from BindingDB
Found 1 hit for monomerid = 314096
TargetInsulin-degrading enzyme(Homo sapiens (Human))
President and Fellows of Harvard College
US Patent
LigandPNGBDBM314096(US9610322, 6b (trans olefin))
Affinity DataIC50:  60nM. Assay description: In vitro protease assays: Protease assays with IDE and neprilysin were performed using Mca-RPPGFSAFK(Dnp)-OH substrate peptide (R&D Systems, SEQ ID N...
Ligand InfoPC cidPC sid
In DepthDetails US Patent