BDBM31617 Aminopyridine N-oxide, 43
SMILES Nc1c(cc[n+]([O-])c1-c1ccc(Cl)cc1)C(=O)c1ccc(F)cc1F
InChI Key InChIKey=SBOOAVNVNJTIPI-UHFFFAOYSA-N
Data  1 IC50
  Tab Delimited (TSV)   2D SDfile   Computed 3D by Vconf -m prep SDfile
Find this compound or compounds like it in BindingDB:
Activity Spreadsheet -- Enzyme Inhibition Constant Data from BindingDB
Found 1 hit for monomerid = 31617
TargetMitogen-activated protein kinase 14(Homo sapiens (Human))
Almirall
LigandPNGBDBM31617(Aminopyridine N-oxide, 43)
Affinity DataIC50:  802nMpH: 7.5 T: 2°C. Assay description: Enzymatic activity assay was performed in 96-well microtiter plates. Various concentrations of the test compound or vehicle controls were preincubate...
In DepthDetails ArticlePubMed