BDBM316975 N-[2,4-Difluoro-3-(4- methylamino-7H-pyrrolo[2,3- d]pyrimidine-5-carbonyl)- phenyl]-4-trifluoromethyl- benzenesulfonamide::US9617267, Compound P-1026
SMILES CNc1ncnc2[nH]cc(C(=O)c3c(F)ccc(NS(=O)(=O)c4ccc(cc4)C(F)(F)F)c3F)c12
InChI Key InChIKey=MQWZUKBWBADKNN-UHFFFAOYSA-N
Data  8 IC50
  Tab Delimited (TSV)   2D SDfile   Computed 3D by Vconf -m prep SDfile
Find this compound or compounds like it in BindingDB:
Activity Spreadsheet -- Enzyme Inhibition Constant Data from BindingDB
Found 8 hits for monomerid = 316975
TargetSerine/threonine-protein kinase B-raf(Homo sapiens (Human))
Plexxikon
US Patent
LigandPNGBDBM316975(N-[2,4-Difluoro-3-(4- methylamino-7H-pyrrolo[2,3- ...)
Affinity DataIC50: >100nM. Assay description: Assays for biochemical and cell based activity are known in the art, for example, as described in PCT publication WO 2007/002433, the disclosure of w...
Ligand InfoPC cidPC sid
In DepthDetails US Patent
TargetEpidermal growth factor receptor [T790M,L858R](Homo sapiens (Human))
Plexxikon
US Patent
LigandPNGBDBM316975(N-[2,4-Difluoro-3-(4- methylamino-7H-pyrrolo[2,3- ...)
Affinity DataIC50: >100nM. Assay description: Assays for biochemical and cell based activity are known in the art, for example, as described in PCT publication WO 2007/002433, the disclosure of w...
Ligand InfoPC cidPC sid
In DepthDetails US Patent
TargetRAF proto-oncogene serine/threonine-protein kinase(Homo sapiens (Human))
Plexxikon
US Patent
LigandPNGBDBM316975(N-[2,4-Difluoro-3-(4- methylamino-7H-pyrrolo[2,3- ...)
Affinity DataIC50: <100nM. Assay description: Assays for biochemical and cell based activity are known in the art, for example, as described in PCT publication WO 2007/002433, the disclosure of w...
Ligand InfoPC cidPC sid
In DepthDetails US Patent
TargetCytochrome P450 3A4(Homo sapiens (Human))
Plexxikon
US Patent
LigandPNGBDBM316975(N-[2,4-Difluoro-3-(4- methylamino-7H-pyrrolo[2,3- ...)
Affinity DataIC50: >1.00E+4nM. Assay description: The inhibition of CYP enzyme activity (IC50) for each of CYP1A2, CYP2C19, CYP2C9, CYP2D6, CYP3A4(BFC) and CYP3A4(BQ) is determined for compounds, whe...
Ligand InfoPC cidPC sid
In DepthDetails US Patent
TargetCytochrome P450 2C19(Homo sapiens (Human))
Plexxikon
US Patent
LigandPNGBDBM316975(N-[2,4-Difluoro-3-(4- methylamino-7H-pyrrolo[2,3- ...)
Affinity DataIC50: >1.00E+4nM. Assay description: The inhibition of CYP enzyme activity (IC50) for each of CYP1A2, CYP2C19, CYP2C9, CYP2D6, CYP3A4(BFC) and CYP3A4(BQ) is determined for compounds, whe...
Ligand InfoPC cidPC sid
In DepthDetails US Patent
TargetCytochrome P450 2C9(Homo sapiens (Human))
Plexxikon
US Patent
LigandPNGBDBM316975(N-[2,4-Difluoro-3-(4- methylamino-7H-pyrrolo[2,3- ...)
Affinity DataIC50: >1.00E+4nM. Assay description: The inhibition of CYP enzyme activity (IC50) for each of CYP1A2, CYP2C19, CYP2C9, CYP2D6, CYP3A4(BFC) and CYP3A4(BQ) is determined for compounds, whe...
Ligand InfoPC cidPC sid
In DepthDetails US Patent
TargetCytochrome P450 2D6(Homo sapiens (Human))
Plexxikon
US Patent
LigandPNGBDBM316975(N-[2,4-Difluoro-3-(4- methylamino-7H-pyrrolo[2,3- ...)
Affinity DataIC50: >1.00E+4nM. Assay description: The inhibition of CYP enzyme activity (IC50) for each of CYP1A2, CYP2C19, CYP2C9, CYP2D6, CYP3A4(BFC) and CYP3A4(BQ) is determined for compounds, whe...
Ligand InfoPC cidPC sid
In DepthDetails US Patent
TargetCytochrome P450 1A2(Homo sapiens (Human))
Plexxikon
US Patent
LigandPNGBDBM316975(N-[2,4-Difluoro-3-(4- methylamino-7H-pyrrolo[2,3- ...)
Affinity DataIC50: >1.00E+4nM. Assay description: The inhibition of CYP enzyme activity (IC50) for each of CYP1A2, CYP2C19, CYP2C9, CYP2D6, CYP3A4(BFC) and CYP3A4(BQ) is determined for compounds, whe...
Ligand InfoPC cidPC sid
In DepthDetails US Patent