BDBM317153 6,7-Dimethyl-2-(2-(1-methyl-3-(pyrrolidin-1-yl)-1H-1,2,4-triazol-5-yl)ethyl)imidazo[1,2-f][1,2,4]triazin-4-ol::US9617271, 11
SMILES Cc1nc2c(O)nc(CCc3nc(nn3C)N3CCCC3)nn2c1C
InChI Key InChIKey=AAMYLOYPZJQPKP-UHFFFAOYSA-N
Data  1 IC50
  Tab Delimited (TSV)   2D SDfile   Computed 3D by Vconf -m prep SDfile
Find this compound or compounds like it in BindingDB:
Activity Spreadsheet -- Enzyme Inhibition Constant Data from BindingDB
Found 1 hit for monomerid = 317153
TargetcAMP and cAMP-inhibited cGMP 3',5'-cyclic phosphodiesterase 10A(Homo sapiens (Human))
Hoffmann-La Roche
US Patent
LigandPNGBDBM317153(6,7-Dimethyl-2-(2-(1-methyl-3-(pyrrolidin-1-yl)-1H...)
Affinity DataIC50:  225nM. Assay description: The human PDE10A full length assay was performed in 96-well micro titer plates. The reaction mixture of 50 μl contained 20 mM HEPES pH=7.5/10 mM...
Ligand InfoPC cidPC sid
In DepthDetails US Patent