BDBM318769 (2S,4S)-1-(2,2-diphenylacetyl)-4-(methyl((2-phenylcyclopropyl)methyl)amino)pyrrolidine-2-carboxylic acid::US10370388, Compound 63::US9624243, 63
SMILES CN(CC1CC1c1ccccc1)[C@H]1C[C@H](N(C1)C(=O)C(c1ccccc1)c1ccccc1)C(O)=O
InChI Key InChIKey=JKDRZXQFDUPUTM-QGCKTULWSA-N
Data  2 IC50
  Tab Delimited (TSV)   2D SDfile   Computed 3D by Vconf -m prep SDfile
Find this compound or compounds like it in BindingDB:
Activity Spreadsheet -- Enzyme Inhibition Constant Data from BindingDB
Found 2 hits for monomerid = 318769
TargetType-2 angiotensin II receptor(Homo sapiens (Human))
Novartis
US Patent
LigandPNGBDBM318769((2S,4S)-1-(2,2-diphenylacetyl)-4-(methyl((2-phenyl...)
Affinity DataIC50:  483nM. Assay description:  120 μL membrane (5 mg protein/well) was incubated with 15 μL of [125I]-CGP42112A and 15 μL of compound at RT for 1.5 hrs. ...
Ligand InfoPC cidPC sid
In DepthDetails US Patent
TargetType-2 angiotensin II receptor(Homo sapiens (Human))
Novartis
US Patent
LigandPNGBDBM318769((2S,4S)-1-(2,2-diphenylacetyl)-4-(methyl((2-phenyl...)
Affinity DataIC50:  483nM. Assay description:  120 μL membrane (5 mg protein/well) was incubated with 15 μL of [125I]-CGP42112A and 15 μL of compound at RT for 1.5 hrs. ...
Ligand InfoPC cidPC sid
In DepthDetails US Patent