BDBM319794 US10174015, Compound 7
SMILES O=C(CCCCCc1ccoc1)N1CCOC1=O
InChI Key InChIKey=YLVSRPZEDFVXFO-UHFFFAOYSA-N
Data  2 IC50
  Tab Delimited (TSV)   2D SDfile   Computed 3D by Vconf -m prep SDfile
Find this compound or compounds like it in BindingDB:
Activity Spreadsheet -- Enzyme Inhibition Constant Data from BindingDB
Found 2 hits for monomerid = 319794
TargetFatty-acid amide hydrolase 1(Homo sapiens (Human))
Xiamen University
US Patent
LigandPNGBDBM319794(US10174015, Compound 7)
Affinity DataIC50: >1.00E+5nM. Assay description: In the Experimental example, endocannabinoid hydrolases used were Fatty Acid Amide Hydrolase (FAAH) and N-acylethanolamide hydrolyzing acid amidase (...
Ligand InfoPC cidPC sid
In DepthDetails US Patent
TargetN-acylethanolamine-hydrolyzing acid amidase(Homo sapiens (Human))
Xiamen University
US Patent
LigandPNGBDBM319794(US10174015, Compound 7)
Affinity DataIC50:  360nM. Assay description: In the Experimental example, endocannabinoid hydrolases used were Fatty Acid Amide Hydrolase (FAAH) and N-acylethanolamide hydrolyzing acid amidase (...
Ligand InfoPC cidPC sid
In DepthDetails US Patent