BDBM32005 MLS000073681::N-(2,3-Dimethyl-phenyl)-2-(5-thiophen-2-yl-tetrazol-2-yl)-acetamide::N-(2,3-dimethylphenyl)-2-(5-thiophen-2-yl-1,2,3,4-tetrazol-2-yl)ethanamide::N-(2,3-dimethylphenyl)-2-(5-thiophen-2-yl-2-tetrazolyl)acetamide::N-(2,3-dimethylphenyl)-2-(5-thiophen-2-yltetrazol-2-yl)acetamide::N-(2,3-dimethylphenyl)-2-[5-(2-thienyl)tetrazol-2-yl]acetamide::SMR000002258::cid_650135
SMILES Cc1cccc(NC(=O)Cn2nnc(n2)-c2cccs2)c1C
InChI Key InChIKey=IZLGEHNAGAEFMY-UHFFFAOYSA-N
Data  1 IC50
  Tab Delimited (TSV)   2D SDfile   Computed 3D by Vconf -m prep SDfile
Find this compound or compounds like it in BindingDB:
Activity Spreadsheet -- Enzyme Inhibition Constant Data from BindingDB
Found 1 hit for monomerid = 32005
TargetHeat shock protein HSP 90-alpha(Homo sapiens (Human))
Emory University
Curated by PubChem BioAssay
LigandPNGBDBM32005(MLS000073681 | N-(2,3-Dimethyl-phenyl)-2-(5-thioph...)
Affinity DataIC50:  5.00E+4nMpH: 7.4 T: 2°C. Assay description: A fluorescence polarization based HTS assay has been developed and optimized for the identification of Hsp90 inhibitors by using tumor cell lysate Hs...
In DepthDetails PCBioAssay