BDBM321105 US10174044, Example 39::methyl (8-((2-amino-2,4-dimethylpentyl)oxy)-6H-isochromeno[3,4-c]pyridin-2-yl)carbamate
SMILES COC(=O)Nc1cc-2c(OCc3cc(OCC(C)(CC(C)C)NC(=O)OC(C)(C)C)ccc-23)cn1
InChI Key InChIKey=URJMDTGQKAJSAA-UHFFFAOYSA-N
Data  1 IC50
  Tab Delimited (TSV)   2D SDfile   Computed 3D by Vconf -m prep SDfile
Find this compound or compounds like it in BindingDB:
Activity Spreadsheet -- Enzyme Inhibition Constant Data from BindingDB
Found 1 hit for monomerid = 321105
TargetAP2-associated protein kinase 1(Homo sapiens (Human))
Bristol-Myers Squibb
US Patent
LigandPNGBDBM321105(US10174044, Example 39 | methyl (8-((2-amino-2,4-d...)
Affinity DataIC50:  8.10nM. Assay description: The assays were performed in U-bottom 384-well plates. The final assay volume was 30 μl prepared from 15 μl additions of enzyme and substra...
Ligand InfoPC cidPC sid
In DepthDetails US Patent