BDBM322618 US10183940, Example 68
SMILES Cc1cccn2c(nnc12)C(C)(C)NC(=O)c1cccc2CNCCOc12
InChI Key InChIKey=YYMTUNPATOUTBK-UHFFFAOYSA-N
Data  1 EC50
  Tab Delimited (TSV)   2D SDfile   Computed 3D by Vconf -m prep SDfile
Find this compound or compounds like it in BindingDB:
Activity Spreadsheet -- Enzyme Inhibition Constant Data from BindingDB
Found 1 hit for monomerid = 322618
TargetSomatostatin receptor type 4(Homo sapiens (Human))
Boehringer Ingelheim International
US Patent
LigandPNGBDBM322618(US10183940, Example 68)
Affinity DataEC50:  37.9nM. Assay description: The activation of the SSTR4 receptor (Gi coupled) causes an inhibition of intracellular cAMP after stimulation with Forskolin, which can be quantifia...
Ligand InfoPC cidPC sid
In DepthDetails US Patent