BDBM323538 3-(3-(Cyclohexylmethoxy)Phenyl)-3-Hydrazonopropan-1-Amine::US10188615, Example 126
SMILES NCC\C(=N/N)c1cccc(OCC2CCCCC2)c1
InChI Key InChIKey=YNIPCXAVDQXMEH-KNTRCKAVSA-N
Data  1 IC50
  Tab Delimited (TSV)   2D SDfile   Computed 3D by Vconf -m prep SDfile
Find this compound or compounds like it in BindingDB:
Activity Spreadsheet -- Enzyme Inhibition Constant Data from BindingDB
Found 1 hit for monomerid = 323538
TargetRetinoid isomerohydrolase(Homo sapiens (Human))
Acucela
US Patent
LigandPNGBDBM323538(3-(3-(Cyclohexylmethoxy)Phenyl)-3-Hydrazonopropan-...)
Affinity DataIC50:  550nM. Assay description: Isomerase inhibition reactions were performed essentially as described (Stecher et al., J. Biol. Chem. 274:8577-85 (1999); see also Golczak et al., P...
Ligand InfoPC cidPC sid
In DepthDetails US Patent