BDBM32617 Botryllamide A, 1::US8470888, Botryllamide A
SMILES CO\C(=C/c1ccc(O)cc1)C(=O)N\C=C\c1cc(Br)c(OC)c(Br)c1
InChI Key InChIKey=VIVASROQEPDEJV-HQFFKOPYSA-N
Data  3 IC50
  Tab Delimited (TSV)   2D SDfile   Computed 3D by Vconf -m prep SDfile
Find this compound or compounds like it in BindingDB:
Activity Spreadsheet -- Enzyme Inhibition Constant Data from BindingDB
Found 3 hits for monomerid = 32617
LigandPNGBDBM32617(Botryllamide A, 1 | US8470888, Botryllamide A)
Affinity DataIC50:  3.34E+4nMpH: 7.4 T: 2°C. Assay description: IC50 and maximal activities for inhibition of PhA accumulation were determined from dose-response curves. The accumulation of PhA, a fluorescent ABCG...
In DepthDetails ArticlePubMed
LigandPNGBDBM32617(Botryllamide A, 1 | US8470888, Botryllamide A)
Affinity DataIC50:  1.12E+4nM. Assay description: Inhibition assay using ABCG2 or BCRP1.
In DepthDetails US Patent
LigandPNGBDBM32617(Botryllamide A, 1 | US8470888, Botryllamide A)
Affinity DataIC50:  3.30E+4nM. Assay description: Inhibition assay using ABCG2 or BCRP1.
In DepthDetails US Patent