BDBM326239 (E)-N-(3-(6-amino-7-(4-cyclopropoxyphenyl)-8-oxo-7H-purin-9(8H)-yl)phenyl)-4-(dimethylamino)-N-methylbut-2-enamide ::US9637487, Compound 28
SMILES CN(C)C\C=C\C(=O)N(C)c1cccc(c1)-n1c2ncnc(N)c2n(-c2ccc(OC3CC3)cc2)c1=O
InChI Key InChIKey=OMJKFMHSOTTWMO-VMPITWQZSA-N
Data  1 IC50
  Tab Delimited (TSV)   2D SDfile   Computed 3D by Vconf -m prep SDfile
Find this compound or compounds like it in BindingDB:
Activity Spreadsheet -- Enzyme Inhibition Constant Data from BindingDB
Found 1 hit for monomerid = 326239
TargetTyrosine-protein kinase BTK(Homo sapiens (Human))
Pharmacyclics
US Patent
LigandPNGBDBM326239((E)-N-(3-(6-amino-7-(4-cyclopropoxyphenyl)-8-oxo-7...)
Affinity DataIC50:  550nM. Assay description: Human Btk kinase (Genbank accession # NP_000052) was purified from insect cells as a full-length construct containing a N-terminal 6×-His tag. Btk ki...
Ligand InfoPC cidPC sid
In DepthDetails US Patent