BDBM327273 4-chloro-N-[5-chloro-2-(methylsulfinyl)phenyl]-2-fluorobenzenesulfonamide::US9663460, Example 63
SMILES CS(=O)c1ccc(Cl)cc1NS(=O)(=O)c1ccc(Cl)cc1F
InChI Key InChIKey=WHUKNFDYHNAXGU-UHFFFAOYSA-N
Data  1 IC50
  Tab Delimited (TSV)   2D SDfile   Computed 3D by Vconf -m prep SDfile
Find this compound or compounds like it in BindingDB:
Activity Spreadsheet -- Enzyme Inhibition Constant Data from BindingDB
Found 1 hit for monomerid = 327273
TargetC-C chemokine receptor type 2(Homo sapiens (Human))
Allergan
US Patent
LigandPNGBDBM327273(4-chloro-N-[5-chloro-2-(methylsulfinyl)phenyl]-2-f...)
Affinity DataIC50:  85nM. Assay description: HEK-Gqi5 cells stably expressing CCR2 were cultured in (DMEM high glucose, 10% FBS, 1% PSA, 400 μg/ml geneticin and 50 μg/ml hygromycin. Ap...
Ligand InfoPC cidPC sid
In DepthDetails US Patent