BDBM333413 4-[6-(2,4-Difluorophenoxy)-1H-benzimidazol-5-yl]-6-methyl-1,6-dihydro-7H-pyrazolo[3,4-c]pyridin-7-one trifluoroacetate::US9737516, Example 9
SMILES Cn1cc(-c2cc3[nH]cnc3cc2Oc2ccc(F)cc2F)c2cn[nH]c2c1=O
InChI Key InChIKey=QPHFLUZYEBTKLI-UHFFFAOYSA-N
Data  2 IC50
  Tab Delimited (TSV)   2D SDfile   Computed 3D by Vconf -m prep SDfile
Find this compound or compounds like it in BindingDB:
Activity Spreadsheet -- Enzyme Inhibition Constant Data from BindingDB
Found 2 hits for monomerid = 333413
TargetBromodomain-containing protein 4 [368-440](Homo sapiens (Human))
Incyte
US Patent
LigandPNGBDBM333413(4-[6-(2,4-Difluorophenoxy)-1H-benzimidazol-5-yl]-6...)
Affinity DataIC50: <100nM. Assay description: BRD4-BD1 and BRD4-BD2 assays were conducted in white 384-well polystyrene plate in a final volume of 20 μL for BD1 and 40 μL for BD2. Inhib...
Ligand InfoPC cidPC sid
In DepthDetails US Patent
TargetBromodomain-containing protein 4 [75-147](Homo sapiens (Human))
Incyte
US Patent
LigandPNGBDBM333413(4-[6-(2,4-Difluorophenoxy)-1H-benzimidazol-5-yl]-6...)
Affinity DataIC50: <100nM. Assay description: BRD4-BD1 and BRD4-BD2 assays were conducted in white 384-well polystyrene plate in a final volume of 20 μL for BD1 and 40 μL for BD2. Inhib...
Ligand InfoPC cidPC sid
In DepthDetails US Patent