BDBM334388 1-(3-(tert-Butyl)-1-(p-tolyl)-1H-pyrazol-5-yl)-3-(4-((2-((4-chloro-3-methoxy-5-(2-(2-(2-methoxyethoxyl)ethoxy)ethoxy)phenyl)amino)pyrimidin-4-yl)oxy)naphthalen-1-yl)urea::US9732063, Example 72
SMILES COCCOCCOCCOc1cc(Nc2nccc(Oc3ccc(NC(=O)Nc4cc(nn4-c4ccc(C)cc4)C(C)(C)C)c4ccccc34)n2)cc(OC)c1Cl
InChI Key InChIKey=UTBOYGRCMFIHJK-UHFFFAOYSA-N
Data  4 IC50
  Tab Delimited (TSV)   2D SDfile   Computed 3D by Vconf -m prep SDfile
Find this compound or compounds like it in BindingDB:
Activity Spreadsheet -- Enzyme Inhibition Constant Data from BindingDB
Found 4 hits for monomerid = 334388
TargetMitogen-activated protein kinase 12(Homo sapiens (Human))
Respivert
US Patent
LigandPNGBDBM334388(1-(3-(tert-Butyl)-1-(p-tolyl)-1H-pyrazol-5-yl)-3-(...)
Affinity DataIC50:  377nM. Assay description: The inhibitory activities of compounds of the invention against p38MAPKγ (MAPK12: Invitrogen), are evaluated in a similar fashion to that descri...
Ligand InfoPC cidPC sid
In DepthDetails US Patent
TargetGlycogen synthase kinase-3 alpha(Homo sapiens (Human))
Respivert
US Patent
LigandPNGBDBM334388(1-(3-(tert-Butyl)-1-(p-tolyl)-1H-pyrazol-5-yl)-3-(...)
Affinity DataIC50: >1.00E+4nM. Assay description: The inhibitory activities of compounds of the invention against the GSK 3α enzyme isoform (Invitrogen), are evaluated by determining the level o...
Ligand InfoPC cidPC sid
In DepthDetails US Patent
TargetTyrosine-protein kinase SYK(Homo sapiens (Human))
Respivert
US Patent
LigandPNGBDBM334388(1-(3-(tert-Butyl)-1-(p-tolyl)-1H-pyrazol-5-yl)-3-(...)
Affinity DataIC50:  75nM. Assay description: c-Src and Syk Enzyme InhibitionThe inhibitory activities of compounds of the invention against c-Src and Syk enzymes (Invitrogen), are evaluated in a...
Ligand InfoPC cidPC sid
In DepthDetails US Patent
TargetProto-oncogene tyrosine-protein kinase Src(Homo sapiens (Human))
Respivert
US Patent
LigandPNGBDBM334388(1-(3-(tert-Butyl)-1-(p-tolyl)-1H-pyrazol-5-yl)-3-(...)
Affinity DataIC50:  39nM. Assay description: c-Src and Syk Enzyme InhibitionThe inhibitory activities of compounds of the invention against c-Src and Syk enzymes (Invitrogen), are evaluated in a...
Ligand InfoPC cidPC sid
In DepthDetails US Patent