BDBM335359 US11040966, Example 7.23::US9732075, Example 7.23::[(S)-2-(5-Chloro-1,4-dimethyl-1H-benzoimidazol-2-yl)-2-methyl-pyrrolidin-1-yl]-(5-methoxy-2-[1,2,3]triazol-2-yl-phenyl)-methanone and/or [(S)-2-(3-Chloro-1,2-dimethyl-1H-benzoimidazol-2-yl)-2-methyl-pyrrolidin-1-yl]-(5-methoxy-2-[1,2,3]triazol-2-yl-phenyl)-methanone (mixtures of isomers)
SMILES COc1ccc(c(c1)C(=O)N1CCC[C@@]1(C)c1nc2c(C)c(Cl)ccc2n1C)-n1nccn1
InChI Key InChIKey=SABPYUNGMHYDLK-DEOSSOPVSA-N
Data  2 IC50
  Tab Delimited (TSV)   2D SDfile   Computed 3D by Vconf -m prep SDfile
Find this compound or compounds like it in BindingDB:
Activity Spreadsheet -- Enzyme Inhibition Constant Data from BindingDB
Found 2 hits for monomerid = 335359
TargetOrexin receptor type 2(Homo sapiens (Human))
Idorsia Pharmaceuticals
US Patent
LigandPNGBDBM335359(US11040966, Example 7.23 | US9732075, Example 7.23...)
Affinity DataIC50:  3nM. Assay description: Chinese hamster ovary (CHO) cells expressing the human orexin-1 receptor and the human orexin-2 receptor, respectively, are grown in culture medium (...
Ligand InfoPC cidPC sid
In DepthDetails US Patent
TargetOrexin/Hypocretin receptor type 1(Homo sapiens (Human))
Idorsia Pharmaceuticals
US Patent
LigandPNGBDBM335359(US11040966, Example 7.23 | US9732075, Example 7.23...)
Affinity DataIC50:  1nM. Assay description: Chinese hamster ovary (CHO) cells expressing the human orexin-1 receptor and the human orexin-2 receptor, respectively, are grown in culture medium (...
Ligand InfoPC cidPC sid
In DepthDetails US Patent