BDBM337373 5-[4-(6, 7-Dihydro-5H-pyrrolo[2, 3-d]pyrimidin-4-yloxy)phenyl]-4,6-dimethylpyridazin-3(2H)-one (11)::US9745317, 11
SMILES COc1ccc(CN2CCc3c2ncnc3Oc2ccc(cc2)-c2c(C)nn(C3CCCCO3)c(=O)c2C)cc1
InChI Key InChIKey=XQJNLZJEGQJRRO-UHFFFAOYSA-N
Data  1 KI
  Tab Delimited (TSV)   2D SDfile   Computed 3D by Vconf -m prep SDfile
Find this compound or compounds like it in BindingDB:
Activity Spreadsheet -- Enzyme Inhibition Constant Data from BindingDB
Found 1 hit for monomerid = 337373
TargetD(1A) dopamine receptor(Homo sapiens (Human))
Pfizer
US Patent
LigandPNGBDBM337373(5-[4-(6, 7-Dihydro-5H-pyrrolo[2, 3-d]pyrimidin-4-y...)
Affinity DataKi:  60.4nM. Assay description: D1 binding assays were performed using over-expressing LTK human cell lines. To determine basic assay parameters, ligand concentrations were determin...
Ligand InfoPC cidPC sid
In DepthDetails US Patent