BDBM337409 US9745321, Compound 27
SMILES COc1ncc(cc1NS(C)(=O)=O)-c1nc(nc2c(CN3C[C@H](C)O[C@H](C)C3)csc12)N1CCOCC1
InChI Key InChIKey=ZXLSDAXVGFEABL-IYBDPMFKSA-N
Data  1 IC50
  Tab Delimited (TSV)   2D SDfile   Computed 3D by Vconf -m prep SDfile
Find this compound or compounds like it in BindingDB:
Activity Spreadsheet -- Enzyme Inhibition Constant Data from BindingDB
Found 1 hit for monomerid = 337409
TargetPhosphatidylinositol 4,5-bisphosphate 3-kinase catalytic subunit delta isoform(Homo sapiens (Human))
Shanghai Yingli Pharmaceutical
US Patent
LigandPNGBDBM337409(US9745321, Compound 27)
Affinity DataIC50:  99nM. Assay description: 1. Buffer preparation: 50 mM HEPES, pH 7.5, 3 mM MgCl2, 1 mM EGTA, 100 mM NaCl, 0.03% CHAPS.2. Compound was formulated in 100% DMSO in a concentratio...
Ligand InfoPC cidPC sid
In DepthDetails US Patent