BDBM33828 1-[3-phenyl-5-(2-thenylamino)-1,2,4-triazol-1-yl]ethanone::1-[3-phenyl-5-(thiophen-2-ylmethylamino)-1,2,4-triazol-1-yl]ethanone::1-acetyl-3-phenyl-N-(2-thienylmethyl)-1H-1,2,4-triazol-5-amine::MLS000664653::SMR000296367::cid_2976015
SMILES CC(=O)n1nc(nc1NCc1cccs1)-c1ccccc1
InChI Key InChIKey=PQTZOZLPXPWAAL-UHFFFAOYSA-N
Data  1 IC50
  Tab Delimited (TSV)   2D SDfile   Computed 3D by Vconf -m prep SDfile
Find this compound or compounds like it in BindingDB:
Activity Spreadsheet -- Enzyme Inhibition Constant Data from BindingDB
Found 1 hit for monomerid = 33828
TargetProthrombin(Homo sapiens (Human))
Pcmd
Curated by PubChem BioAssay
LigandPNGBDBM33828(1-[3-phenyl-5-(2-thenylamino)-1,2,4-triazol-1-yl]e...)
Affinity DataIC50:  96.5nMpH: 7.5 T: 2°C. Assay description: HTS was performed using 217,350 compounds of the MLSCN library individually plated into 10ul 1536 compound plates at a concentration of 2.5 mM each, ...
In DepthDetails PCBioAssay