BDBM340251 (2S,4R)-N2-(3-chloro- 2-fluorobenzyl)-N1-(1- (cyclopropanecarbonyl)- 1H-indol-3-yl)-4- fluoropyrrolidine-1,2- dicarboxamide::US9758537, Compound 54
SMILES F[C@@H]1C[C@H](N(C1)C(=O)Nc1cn(C(=O)C2CC2)c2ccccc12)C(=O)NCc1cccc(Cl)c1F
InChI Key InChIKey=WWMILMXZWCGYEJ-IERDGZPVSA-N
Data  1 IC50
  Tab Delimited (TSV)   2D SDfile   Computed 3D by Vconf -m prep SDfile
Find this compound or compounds like it in BindingDB:
Activity Spreadsheet -- Enzyme Inhibition Constant Data from BindingDB
Found 1 hit for monomerid = 340251
TargetComplement factor D(Homo sapiens (Human))
Achillion Pharmaceuticals
US Patent
LigandPNGBDBM340251((2S,4R)-N2-(3-chloro- 2-fluorobenzyl)-N1-(1- (cycl...)
Affinity DataIC50: <1.00E+3nM. Assay description: Human factor D (purified from human serum, Complement Technology, Inc.) at 80 nM final concentration is incubated with test compound at various conce...
Ligand InfoPC cidPC sid
In DepthDetails US Patent