BDBM340513 US9763922, Example 44
SMILES CC(=O)N1CCc2c(C1)c(Nc1ccccc1)nn2CC1CC1
InChI Key InChIKey=KMZUZVOMPHYZRW-UHFFFAOYSA-N
Data  3 IC50
  Tab Delimited (TSV)   2D SDfile   Computed 3D by Vconf -m prep SDfile
Find this compound or compounds like it in BindingDB:
Activity Spreadsheet -- Enzyme Inhibition Constant Data from BindingDB
Found 3 hits for monomerid = 340513
TargetCREB-binding protein(Homo sapiens (Human))
Genentech
US Patent
LigandPNGBDBM340513(US9763922, Example 44)
Affinity DataIC50:  150nM. Assay description: His/Flag epitope tagged CBP was cloned, expressed, and purified to homogeneity. CBP binding and inhibition was assessed by monitoring the engagement ...
Ligand InfoPC cidPC sid
In DepthDetails US Patent
TargetCREB-binding protein(Homo sapiens (Human))
Genentech
US Patent
LigandPNGBDBM340513(US9763922, Example 44)
Affinity DataIC50:  150nM. Assay description: Inhibition of recombinant His-tagged CBP (unknown origin) by TR-FRET assay
Ligand InfoPC cidPC sid
In DepthDetails ArticlePubMed
TargetBromodomain-containing protein 4(Homo sapiens (Human))
Genentech
US Patent
LigandPNGBDBM340513(US9763922, Example 44)
Affinity DataIC50:  1.11E+4nM. Assay description: His/Flag epitope tagged BRD4 BD142-168 was cloned, expressed, and purified to. BRD4 binding and inhibition was assessed by monitoring the engagement ...
Ligand InfoPC cidPC sid
In DepthDetails US Patent