BDBM344236 N-{2-methoxy-6-[(3aR,6aR)-5-methylhexahydropyrrolo[3,4-b]pyrrol-1 (2H)-yl]pyridin-3-yl}-6,6-dimethyl-4-oxo-4,5,6,7-tetrahydrofuro[3,2-c]pyridine-3-carboxamide::US9777020, Example 130
SMILES COc1nc(ccc1NC(=O)c1coc2CC(C)(C)NC(=O)c12)N1CC[C@@H]2CN(C)C[C@H]12
InChI Key InChIKey=AOEFWFMRGCUXTR-CJNGLKHVSA-N
Data  1 IC50
  Tab Delimited (TSV)   2D SDfile   Computed 3D by Vconf -m prep SDfile
Find this compound or compounds like it in BindingDB:
Activity Spreadsheet -- Enzyme Inhibition Constant Data from BindingDB
Found 1 hit for monomerid = 344236
TargetHigh affinity nerve growth factor receptor(Homo sapiens (Human))
Abbvie
US Patent
LigandPNGBDBM344236(N-{2-methoxy-6-[(3aR,6aR)-5-methylhexahydropyrrolo...)
Affinity DataIC50:  38.3nM
Ligand InfoPC cidPC sid
In DepthDetails US Patent