BDBM344376 (1S,3R*)-1-(3-fluoro-2-methylphenyl)-N-hydroxy-3-(1-methyl-1H-indazol-7-yl)cyclopentanecarboxamide::US9783488, Example 60
SMILES Cc1c(F)cccc1[C@@]1(CC[C@H](C1)c1cccc2cnn(C)c12)C(=O)NO
InChI Key InChIKey=OCQSPWATZYHFJK-SZNDQCEHSA-N
Data  1 IC50
  Tab Delimited (TSV)   2D SDfile   Computed 3D by Vconf -m prep SDfile
Find this compound or compounds like it in BindingDB:
Activity Spreadsheet -- Enzyme Inhibition Constant Data from BindingDB
Found 1 hit for monomerid = 344376
TargetHistone deacetylase 4(Homo sapiens (Human))
Chdi Foundation
US Patent
LigandPNGBDBM344376((1S,3R*)-1-(3-fluoro-2-methylphenyl)-N-hydroxy-3-(...)
Affinity DataIC50:  360nM. Assay description: The potency of Class IIa Histone Deacetylase (HDAC) inhibitors is quantified by measuring the Histone Deacetylase 4 (HDAC4) catalytic domain enzymati...
Ligand InfoPC cidPC sid
In DepthDetails US Patent